Target
Replicase polyprotein 1ab
Ligand
BDBM479498
Substrate
Meas. Tech.
plaque reduction assay
EC50
3240±270 nM
Citation
 Han, SHGoins, CMArya, TShin, WJMaw, JHooper, ASonawane, DPPorter, MRBannister, BECrouch, RDLindsey, AALakatos, GMartinez, SRAlvarado, JAkers, WSWang, NSJung, JUMacdonald, JDStauffer, SR Structure-Based Optimization of ML300-Derived, Noncovalent Inhibitors Targeting the Severe Acute Respiratory Syndrome Coronavirus 3CL Protease (SARS-CoV-2 3CL J Med Chem 65:2880-2904 (2021)  
Target
Name:
Replicase polyprotein 1ab
Synonyms:
ORF1ab polyprotein pp1ab | rep
Type:
Protein
Mol. Mass.:
794070.71
Organism:
2019-nCoV
Description:
P0DTD1
Residue:
7096
  
Inhibitor
Name:
BDBM479498
Synonyms:
ML300-based SC inhibitor 37
Type:
Small Organic Molecule
Emp. Form.:
C25H21ClN6O2
Mol. Mass.:
472.926
SMILES:
COc1cc(ccc1-c1cn[nH]c1)N(Cc1cccc(Cl)c1)C(=O)Cn1nnc2ccccc12
: