Target
Fatty acid 2-hydroxylase
Ligand
BDBM483644
Substrate
Meas. Tech.
In Vitro Competitive Activity-Based Protein Profiling
IC50
<100±n/a nM
Citation
 Grice, CAWiener, JJWeber, ODDuncan, KK Pyrazole MAGL inhibitors US Patent  US10927105 Publication Date 2/23/2021 
Target
Name:
Fatty acid 2-hydroxylase
Synonyms:
FA2H FAAH Fatty acid alpha-hydroxylase | Fatty acid hydroxylase domain-containing protein 1
Type:
Protein
Mol. Mass.:
42806.38
Organism:
Human
Description:
Q7L5A8
Residue:
372
  
Inhibitor
Name:
BDBM483644
Synonyms:
US10927105, Ex 17 | US11655217, Example 17
Type:
Small organic molecule
Emp. Form.:
C23H27F3N6O3
Mol. Mass.:
492.4941
SMILES:
NC(=O)c1ccn(n1)C(=O)N1CC2CN(Cc3ccc(cc3C(F)(F)F)N3CCOCC3)CC2C1
: