Target
Fatty acid 2-hydroxylase
Ligand
BDBM483690
Substrate
Meas. Tech.
In Vitro Competitive Activity-Based Protein Profiling
IC50
550±n/a nM
Citation
 Grice, CAWiener, JJWeber, ODDuncan, KK Pyrazole MAGL inhibitors US Patent  US10927105 Publication Date 2/23/2021 
Target
Name:
Fatty acid 2-hydroxylase
Synonyms:
FA2H FAAH Fatty acid alpha-hydroxylase | Fatty acid hydroxylase domain-containing protein 1
Type:
Protein
Mol. Mass.:
42806.38
Organism:
Human
Description:
Q7L5A8
Residue:
372
  
Inhibitor
Name:
BDBM483690
Synonyms:
4-chloro-1-(5-(2,5- dichlorobenzyl)- octahydropyrrolo- [3,4-c]pyrrole-2- carbonyl)-1H- pyrazole-3- carboxylic acid US11655217, Example 136
Type:
Small organic molecule
Emp. Form.:
C18H17Cl3N4O3
Mol. Mass.:
443.712
SMILES:
OC(=O)c1nn(cc1Cl)C(=O)N1CC2CN(Cc3cc(Cl)ccc3Cl)CC2C1
: