Target
Fatty acid 2-hydroxylase
Ligand
BDBM483716
Substrate
Meas. Tech.
In Vitro Competitive Activity-Based Protein Profiling
IC50
550±n/a nM
Citation
 Grice, CAWiener, JJWeber, ODDuncan, KK Pyrazole MAGL inhibitors US Patent  US10927105 Publication Date 2/23/2021 
Target
Name:
Fatty acid 2-hydroxylase
Synonyms:
FA2H FAAH Fatty acid alpha-hydroxylase | Fatty acid hydroxylase domain-containing protein 1
Type:
Protein
Mol. Mass.:
42806.38
Organism:
Human
Description:
Q7L5A8
Residue:
372
  
Inhibitor
Name:
BDBM483716
Synonyms:
1-(4-(2-morpholino- 3-(trifluoromethyl)- benzyl)piperazine-1- carbonyl)-1H- pyrazole-3- carboxamide US11655217, Example 199
Type:
Small organic molecule
Emp. Form.:
C21H25F3N6O3
Mol. Mass.:
466.4568
SMILES:
NC(=O)c1ccn(n1)C(=O)N1CCN(Cc2cccc(c2N2CCOCC2)C(F)(F)F)CC1
: