Target
Replicase polyprotein 1ab
Ligand
BDBM476991
Substrate
Meas. Tech.
kinetic assay
IC50
131±9.00 nM
Citation
 Zhang, CHSpasov, KAReilly, RAHollander, KStone, EAIppolito, JALiosi, MEDeshmukh, MGTirado-Rives, JZhang, SLiang, ZMiller, SJIsaacs, FLindenbach, BDAnderson, KSJorgensen, WL Optimization of Triarylpyridinone Inhibitors of the Main Protease of SARS-CoV-2 to Low-Nanomolar Antiviral Potency. ACS Med Chem Lett 12:1325-1332 (2021)  
Target
Name:
Replicase polyprotein 1ab
Synonyms:
ORF1ab polyprotein pp1ab | rep
Type:
Protein
Mol. Mass.:
794070.71
Organism:
2019-nCoV
Description:
P0DTD1
Residue:
7096
  
Inhibitor
Name:
BDBM476991
Synonyms:
Inhibitor 11 of SARS-CoV-2 Mpro
Type:
Small organic molecule
Emp. Form.:
C25H18ClN5O5
Mol. Mass.:
503.894
SMILES:
Cc1ncoc1COc1cc(Cl)cc(c1)-c1cc(cn(-c2cccnc2)c1=O)-c1c[nH]c(=O)[nH]c1=O
: