Target
Replicase polyprotein 1ab
Ligand
BDBM484209
Substrate
Meas. Tech.
kinetic assay
IC50
59±14 nM
Citation
 Zhang, CHSpasov, KAReilly, RAHollander, KStone, EAIppolito, JALiosi, MEDeshmukh, MGTirado-Rives, JZhang, SLiang, ZMiller, SJIsaacs, FLindenbach, BDAnderson, KSJorgensen, WL Optimization of Triarylpyridinone Inhibitors of the Main Protease of SARS-CoV-2 to Low-Nanomolar Antiviral Potency. ACS Med Chem Lett 12:1325-1332 (2021)  
Target
Name:
Replicase polyprotein 1ab
Synonyms:
ORF1ab polyprotein pp1ab | rep
Type:
Protein
Mol. Mass.:
794070.71
Organism:
2019-nCoV
Description:
P0DTD1
Residue:
7096
  
Inhibitor
Name:
BDBM484209
Synonyms:
Inhibitor 17 of SARS-CoV-2 Mpro
Type:
Small organic molecule
Emp. Form.:
C24H18ClF3N4O4
Mol. Mass.:
518.872
SMILES:
Cn1cc(-c2cc(-c3cc(Cl)cc(OCCC(F)(F)F)c3)c(=O)n(c2)-c2cccnc2)c(=O)[nH]c1=O
: