Target
Replicase polyprotein 1ab
Ligand
BDBM476998
Substrate
Meas. Tech.
kinetic assay
IC50
28±7.00 nM
Citation
 Zhang, CHSpasov, KAReilly, RAHollander, KStone, EAIppolito, JALiosi, MEDeshmukh, MGTirado-Rives, JZhang, SLiang, ZMiller, SJIsaacs, FLindenbach, BDAnderson, KSJorgensen, WL Optimization of Triarylpyridinone Inhibitors of the Main Protease of SARS-CoV-2 to Low-Nanomolar Antiviral Potency. ACS Med Chem Lett 12:1325-1332 (2021)  
Target
Name:
Replicase polyprotein 1ab
Synonyms:
ORF1ab polyprotein pp1ab | rep
Type:
Protein
Mol. Mass.:
794070.71
Organism:
2019-nCoV
Description:
P0DTD1
Residue:
7096
  
Inhibitor
Name:
BDBM476998
Synonyms:
Inhibitor 18 of SARS-CoV-2 Mpro
Type:
Small organic molecule
Emp. Form.:
C27H17Cl2FN4O4
Mol. Mass.:
551.353
SMILES:
Fc1c(Cl)cc(cc1OCc1ccccc1Cl)-c1cc(cn(-c2cccnc2)c1=O)-c1c[nH]c(=O)[nH]c1=O
: