Target
Replicase polyprotein 1ab
Ligand
BDBM476977
Substrate
Meas. Tech.
replicon assay
EC50
1510±10.00 nM
Citation
 Zhang, CHSpasov, KAReilly, RAHollander, KStone, EAIppolito, JALiosi, MEDeshmukh, MGTirado-Rives, JZhang, SLiang, ZMiller, SJIsaacs, FLindenbach, BDAnderson, KSJorgensen, WL Optimization of Triarylpyridinone Inhibitors of the Main Protease of SARS-CoV-2 to Low-Nanomolar Antiviral Potency. ACS Med Chem Lett 12:1325-1332 (2021)  
Target
Name:
Replicase polyprotein 1ab
Synonyms:
ORF1ab polyprotein pp1ab | rep
Type:
Protein
Mol. Mass.:
794070.71
Organism:
2019-nCoV
Description:
P0DTD1
Residue:
7096
  
Inhibitor
Name:
BDBM476977
Synonyms:
Inhibitor 2 of SARS-CoV-2 Mpro
Type:
Small organic molecule
Emp. Form.:
C26H20ClN3O2
Mol. Mass.:
441.909
SMILES:
CCCOc1cc(Cl)cc(c1)-c1cc(cn(-c2cccnc2)c1=O)-c1ccccc1C#N
: