Target
Replicase polyprotein 1ab
Ligand
BDBM484195
Substrate
Meas. Tech.
Enzymatic Inhibition of UAWJ9-36-1 and UAWJ9-36-3 against the Mpro's from Seven Human Coronaviruses
IC50
110±11 nM
Citation
 Xia, ZSacco, MHu, YMa, CMeng, XZhang, FSzeto, TXiang, YChen, YWang, J Rational Design of Hybrid SARS-CoV-2 Main Protease Inhibitors Guided by the Superimposed Cocrystal Structures with the Peptidomimetic Inhibitors GC-376, Telaprevir, and Boceprevir. ACS Pharmacol Transl Sci 4:1408-1421 (2021)  
Target
Name:
Replicase polyprotein 1ab
Synonyms:
ORF1ab polyprotein pp1ab | rep
Type:
Protein
Mol. Mass.:
754187.17
Organism:
HCoV-229E
Description:
P0C6X1
Residue:
6758
  
Inhibitor
Name:
BDBM484195
Synonyms:
UAWJ9-36-3
Type:
Small organic molecule
Emp. Form.:
C23H29N3O5
Mol. Mass.:
427.4935
SMILES:
CC1(C)[C@H]2CN([C@@H]([C@@H]12)C(=O)N[C@@H](C[C@@H]1CCNC1=O)C=O)C(=O)OCc1ccccc1
: