Target
Replicase polyprotein 1ab
Ligand
BDBM484194
Substrate
Meas. Tech.
Enzymatic Inhibition of UAWJ9-36-1 and UAWJ9-36-3 against the Mpro's from Seven Human Coronaviruses
IC50
51±2.20 nM
Citation
 Xia, ZSacco, MHu, YMa, CMeng, XZhang, FSzeto, TXiang, YChen, YWang, J Rational Design of Hybrid SARS-CoV-2 Main Protease Inhibitors Guided by the Superimposed Cocrystal Structures with the Peptidomimetic Inhibitors GC-376, Telaprevir, and Boceprevir. ACS Pharmacol Transl Sci 4:1408-1421 (2021)  
Target
Name:
Replicase polyprotein 1ab
Synonyms:
ORF1ab polyprotein pp1ab | rep
Type:
Protein
Mol. Mass.:
794070.71
Organism:
2019-nCoV
Description:
P0DTD1
Residue:
7096
  
Inhibitor
Name:
BDBM484194
Synonyms:
UAWJ9-36-1
Type:
Small organic molecule
Emp. Form.:
C23H29N3O5
Mol. Mass.:
427.4935
SMILES:
O=C[C@H](C[C@@H]1CCNC1=O)NC(=O)[C@@H]1[C@H]2CCC[C@H]2CN1C(=O)OCc1ccccc1
: