Target
Serine protease 1
Ligand
BDBM484195
Substrate
Meas. Tech.
Enzymatic Inhibition of UAWJ9-36-1 and UAWJ9-36-3 against the Mpro's from Seven Human Coronaviruses
IC50
>20000±n/a nM
Citation
 Xia, ZSacco, MHu, YMa, CMeng, XZhang, FSzeto, TXiang, YChen, YWang, J Rational Design of Hybrid SARS-CoV-2 Main Protease Inhibitors Guided by the Superimposed Cocrystal Structures with the Peptidomimetic Inhibitors GC-376, Telaprevir, and Boceprevir. ACS Pharmacol Transl Sci 4:1408-1421 (2021)  
Target
Name:
Serine protease 1
Synonyms:
Alpha-trypsin chain 1 Beta-trypsin PRSS1 TRP1 TRY1_HUMAN Thrombin & trypsin Trypsin I | Trypsin-1
Type:
Enzyme
Mol. Mass.:
26557.80
Organism:
Homo sapiens (Human)
Description:
P07477
Residue:
247
  
Inhibitor
Name:
BDBM484195
Synonyms:
UAWJ9-36-3
Type:
Small organic molecule
Emp. Form.:
C23H29N3O5
Mol. Mass.:
427.4935
SMILES:
CC1(C)[C@H]2CN([C@@H]([C@@H]12)C(=O)N[C@@H](C[C@@H]1CCNC1=O)C=O)C(=O)OCc1ccccc1
: