Target
Replicase polyprotein 1ab
Ligand
BDBM484197
Substrate
Meas. Tech.
RTCA Assay for Evaluating In Vitro Inhibition of SARS-CoV-2 Replication by Mpro Inhibitors
IC50
2500±n/a nM
Citation
 Chamakuri, SLu, SUcisik, MNBohren, KMChen, YCDu, HCFaver, JCJimmidi, RLi, FLi, JYNyshadham, PPalmer, SSPollet, JQin, XRonca, SESankaran, BSharma, KLTan, ZVersteeg, LYu, ZMatzuk, MMPalzkill, TYoung, DW DNA-encoded chemistry technology yields expedient access to SARS-CoV-2 M Proc Natl Acad Sci U S A 118:0 (2021)  
Target
Name:
Replicase polyprotein 1ab
Synonyms:
ORF1ab polyprotein pp1ab | rep
Type:
Protein
Mol. Mass.:
794070.71
Organism:
2019-nCoV
Description:
P0DTD1
Residue:
7096
  
Inhibitor
Name:
BDBM484197
Synonyms:
CDD-1976 | WO2023004291, Compound CDD-1976
Type:
Small organic molecule
Emp. Form.:
C18H17N3O3
Mol. Mass.:
323.3459
SMILES:
CN(C)C(=O)COc1ccc(cc1C=O)-c1cccc2[nH]ncc12
: