Target
Fibroblast growth factor receptor 2
Ligand
BDBM301369
Substrate
IC50
<100±n/a nM
Citation
 Wu, LZhang, CHe, CLu, LYao, W Substituted tricyclic compounds as FGFR inhibitors US Patent  US10131667 Publication Date 11/20/2018 
Target
Name:
Fibroblast growth factor receptor 2
Synonyms:
BEK FGFR-2 FGFR2 Fibroblast growth factor receptor 2 (FGFR2) KGFR Keratinocyte growth factor receptor VEGF-receptor 2 and Fibroblast growth factor receptor 2
Type:
Enzyme
Mol. Mass.:
92015.45
Organism:
Homo sapiens (Human)
Description:
P21802
Residue:
821
  
Inhibitor
Name:
BDBM301369
Synonyms:
3-(2,6-difluoro-3,5-dimethoxyphenyl)-1-ethyl-8-(2-morpholin-4-ylethyl)-1,3,4,7-tetrahydro-2H-pyrrolo[3',2':5,6]pyrido[4,3-d]pyrimidin-2-one US11053246, Example 185 | US9611267, Example 185
Type:
Small organic molecule
Emp. Form.:
C25H29F2N5O4
Mol. Mass.:
501.5257
SMILES:
CCN1C(=O)N(Cc2cnc3[nH]c(CCN4CCOCC4)cc3c12)c1c(F)c(OC)cc(OC)c1F
: