Target
Bone morphogenetic protein receptor type-1A [198-525]
Ligand
BDBM451805
Substrate
Meas. Tech.
ADPGlo Assay
IC50
960±n/a nM
Citation
 Arista, LBabu, SBian, JCui, KDillon, MPLattmann, RLi, JLiao, LLizos, DRamos, RStiefl, NJUllrich, TUsselmann, PWang, XWaykole, LMWeiler, SZhang, YZhou, YZhu, T Aminopyridine derivatives and their use as selective ALK-2 inhibitors US Patent  US10947218 Publication Date 3/16/2021 
Target
Name:
Bone morphogenetic protein receptor type-1A [198-525]
Synonyms:
ACVRLK3 Activin receptor-like kinase 3 (ALK3) (aa 198-525) BMPR1A | BMR1A_HUMAN
Type:
Enzyme Catalytic Domain
Mol. Mass.:
37140.17
Organism:
Homo sapiens (Human)
Description:
aa 198-525
Residue:
328
  
Inhibitor
Name:
BDBM451805
Synonyms:
US10710980, Example 37 | US10947218, Example 37
Type:
Small organic molecule
Emp. Form.:
C27H32N4O2
Mol. Mass.:
444.5686
SMILES:
CC#CCN1C[C@@H]2C[C@@]2(C1)c1ccc(cc1)-c1cnc(N)c(c1)C(=O)N[C@H]1CC[C@H](O)CC1
: