Target
Diacylglycerol O-acyltransferase 2
Ligand
BDBM486393
Substrate
Meas. Tech.
DGAT2 Enzymatic Activity Assay
IC50
0.770±n/a nM
Citation
 Shen, DGraham, THJiang, JDing, FTudge, C Indole derivatives useful as inhibitors of diacylglyceride O-acyltransferase 2 US Patent  US10947222 Publication Date 3/16/2021 
Target
Name:
Diacylglycerol O-acyltransferase 2
Synonyms:
ARAT DGAT2 Diacylglycerol O-acyltransferase 2 (DGAT2) Retinol O-fatty-acyltransferase
Type:
Multi-pass membrane protein
Mol. Mass.:
43848.90
Organism:
Homo sapiens (Human)
Description:
Q96PD7
Residue:
388
  
Inhibitor
Name:
BDBM486393
Synonyms:
3-(5-(difluoromethoxy)pyridin- 3-yl)-1-(4-fluorophenyl)-N-(3- methyl-1,1- dioxidotetrahydrothiophen-3- yl)-1H-indole-6-carboxamide (racemic) | US10947222, Example 25
Type:
Small organic molecule
Emp. Form.:
C26H22F3N3O4S
Mol. Mass.:
529.531
SMILES:
CC1(CCS(=O)(=O)C1)NC(=O)c1ccc2c(cn(-c3ccc(F)cc3)c2c1)-c1cncc(OC(F)F)c1
: