Target
Mitogen-activated protein kinase kinase kinase 12
Ligand
BDBM301553
Substrate
Meas. Tech.
DLK TR-FRET Inhibition Assay
Ki
6.79±n/a nM
Citation
 Estrada, APatel, SKellar, THuestis, MShore, DSiu, M Tricyclic DLK inhibitors and uses thereof US Patent  US10131675 Publication Date 11/20/2018 
Target
Name:
Mitogen-activated protein kinase kinase kinase 12
Synonyms:
DLK Leucine-zipper protein kinase MAP3K12 MUK Mixed lineage kinase | ZPK
Type:
PROTEIN
Mol. Mass.:
93216.56
Organism:
Homo sapiens (Human)
Description:
ChEMBL_1460553
Residue:
859
  
Inhibitor
Name:
BDBM301553
Synonyms:
US10131675, Example 39
Type:
Small organic molecule
Emp. Form.:
C21H20F3N7O2
Mol. Mass.:
459.4244
SMILES:
CC1(C)OCCn2c1nc1c(nc(nc21)-c1cnc2[nH]cc(c2c1)C(F)(F)F)N1CC(O)C1
: