Target
Bifunctional phosphoribosylaminoimidazole carboxylase/phosphoribosylaminoimidazole succinocarboxamide synthetase
Ligand
BDBM489196
Substrate
Meas. Tech.
Biochemical Assay
IC50
17.5±n/a nM
Citation
 Osborne, SLarge, J Oxazole derivatives for use in the treatment of cancer US Patent  US10961233 Publication Date 3/30/2021 
Target
Name:
Bifunctional phosphoribosylaminoimidazole carboxylase/phosphoribosylaminoimidazole succinocarboxamide synthetase
Synonyms:
ADE2 Multifunctional protein ADE2 PAIS | PUR6_HUMAN
Type:
Protein
Mol. Mass.:
47081.21
Organism:
Human
Description:
P22234
Residue:
425
  
Inhibitor
Name:
BDBM489196
Synonyms:
US10961233, Example 45
Type:
Small organic molecule
Emp. Form.:
C18H23BrN6O3
Mol. Mass.:
451.318
SMILES:
CN(C)CCN1CCN(CC1=O)c1cccc(Br)c1NC(=O)c1coc(N)n1
: