Target
Bifunctional phosphoribosylaminoimidazole carboxylase/phosphoribosylaminoimidazole succinocarboxamide synthetase
Ligand
BDBM489203
Substrate
Meas. Tech.
Biochemical Assay
IC50
62.5±n/a nM
Citation
 Osborne, SLarge, J Oxazole derivatives for use in the treatment of cancer US Patent  US10961233 Publication Date 3/30/2021 
Target
Name:
Bifunctional phosphoribosylaminoimidazole carboxylase/phosphoribosylaminoimidazole succinocarboxamide synthetase
Synonyms:
ADE2 Multifunctional protein ADE2 PAIS | PUR6_HUMAN
Type:
Protein
Mol. Mass.:
47081.21
Organism:
Human
Description:
P22234
Residue:
425
  
Inhibitor
Name:
BDBM489203
Synonyms:
US10961233, Example 58
Type:
Small organic molecule
Emp. Form.:
C19H25ClN6O4S
Mol. Mass.:
468.958
SMILES:
Nc1nc(co1)C(=O)Nc1cc(ccc1Cl)N1CCN(CC1)S(=O)(=O)CCNC1CC1
: