Target
Receptor-type tyrosine-protein kinase FLT3
Ligand
BDBM239031
Substrate
Meas. Tech.
FLT3 Kinase Assay
IC50
62.0±n/a nM
Citation
 Lombardi Borgia, ACiomei, MDonati, DNesi, M Substituted indazole derivatives active as kinase inhibitiors US Patent  US9597317 Publication Date 3/21/2017 
Target
Name:
Receptor-type tyrosine-protein kinase FLT3
Synonyms:
CD135 FL cytokine receptor FLK2 FLT3 Fetal liver kinase-2 Fms-like tyrosine kinase 3 (Flt-3) STK-1 Stem cell tyrosine kinase 1
Type:
Enzyme
Mol. Mass.:
112888.62
Organism:
Homo sapiens (Human)
Description:
P36888
Residue:
993
  
Inhibitor
Name:
BDBM239031
Synonyms:
US10028934, Compound 17 US9408850, 17 | US9597317, 17
Type:
Small organic molecule
Emp. Form.:
C29H35N5O3
Mol. Mass.:
501.6199
SMILES:
CN(C)CCCN(C)c1ccc(cc1)C(=O)Nc1n[nH]c2cc(OCCOCc3ccccc3)ccc12
: