Target
Mast/stem cell growth factor receptor Kit
Ligand
BDBM239023
Substrate
Meas. Tech.
KIT Kinase Assay
IC50
<50.0±n/a nM
Citation
 Lombardi Borgia, ACiomei, MDonati, DNesi, M Substituted indazole derivatives active as kinase inhibitiors US Patent  US9597317 Publication Date 3/21/2017 
Target
Name:
Mast/stem cell growth factor receptor Kit
Synonyms:
CD117 antigen KIT Mast/stem cell growth factor receptor Kit (cKIT) Proto-oncogene tyrosine-protein kinase Kit Stem cell growth factor receptor Tyrosine-protein kinase Kit c-kit v-kit Hardy-Zuckerman 4 feline sarcoma viral oncogene homolog
Type:
Protein
Mol. Mass.:
109869.37
Organism:
Homo sapiens (Human)
Description:
P10721
Residue:
976
  
Inhibitor
Name:
BDBM239023
Synonyms:
US10028934, Compound 32 US9408850, 32 | US9597317, 32
Type:
Small organic molecule
Emp. Form.:
C28H30FN5O3
Mol. Mass.:
503.5679
SMILES:
CN1CCN(CC1)c1ccc(cc1)C(=O)Nc1n[nH]c2cc(OCCOCc3ccc(F)cc3)ccc12
: