Target
Receptor-type tyrosine-protein kinase FLT3
Ligand
BDBM239021
Substrate
Meas. Tech.
FLT3 Kinase Assay
IC50
539±n/a nM
Citation
 Lombardi Borgia, ACiomei, MDonati, DNesi, M Substituted indazole derivatives active as kinase inhibitiors US Patent  US9597317 Publication Date 3/21/2017 
Target
Name:
Receptor-type tyrosine-protein kinase FLT3
Synonyms:
CD135 FL cytokine receptor FLK2 FLT3 Fetal liver kinase-2 Fms-like tyrosine kinase 3 (Flt-3) STK-1 Stem cell tyrosine kinase 1
Type:
Enzyme
Mol. Mass.:
112888.62
Organism:
Homo sapiens (Human)
Description:
P36888
Residue:
993
  
Inhibitor
Name:
BDBM239021
Synonyms:
US10028934, Compound 38 US9408850, 38 | US9597317, 38
Type:
Small organic molecule
Emp. Form.:
C28H30FN5O3
Mol. Mass.:
503.5679
SMILES:
CN1CCN(CC1)c1ccc(C(=O)Nc2n[nH]c3cc(OCCOCc4ccccc4)ccc23)c(F)c1
: