Target
Receptor-type tyrosine-protein kinase FLT3
Ligand
BDBM239044
Substrate
Meas. Tech.
FLT3 Kinase Assay
IC50
3175±n/a nM
Citation
 Lombardi Borgia, ACiomei, MDonati, DNesi, M Substituted indazole derivatives active as kinase inhibitiors US Patent  US9597317 Publication Date 3/21/2017 
Target
Name:
Receptor-type tyrosine-protein kinase FLT3
Synonyms:
CD135 FL cytokine receptor FLK2 FLT3 Fetal liver kinase-2 Fms-like tyrosine kinase 3 (Flt-3) STK-1 Stem cell tyrosine kinase 1
Type:
Enzyme
Mol. Mass.:
112888.62
Organism:
Homo sapiens (Human)
Description:
P36888
Residue:
993
  
Inhibitor
Name:
BDBM239044
Synonyms:
US10478423, Ref. Compound US9597317, Ref. Compound
Type:
Small organic molecule
Emp. Form.:
C23H22N4O2
Mol. Mass.:
386.4464
SMILES:
CN(C)c1ccc(cc1)C(=O)Nc1n[nH]c2cc(OCc3ccccc3)ccc12
: