Target
Non-receptor tyrosine-protein kinase TYK2
Ligand
BDBM490678
Substrate
Meas. Tech.
Caliper Assay
Ki
<10±n/a nM
Citation
 Dahlgren, MGreenwood, JRHarriman, GCKennedy-Smith, JJMasse, CERomero, DLShelley, MWester, RT TYK2 inhibitors and uses thereof US Patent  US10968236 Publication Date 4/6/2021 
Target
Name:
Non-receptor tyrosine-protein kinase TYK2
Synonyms:
Non-receptor tyrosine-protein kinase TYK2 (TYK2) TYK2_HUMAN | Tyrosine-protein kinase TYK2
Type:
Protein
Mol. Mass.:
133666.03
Organism:
Homo sapiens (Human)
Description:
P29597
Residue:
1187
  
Inhibitor
Name:
BDBM490678
Synonyms:
US10968236, Compound I-5
Type:
Small organic molecule
Emp. Form.:
C25H21F2N5O3
Mol. Mass.:
477.4627
SMILES:
Fc1cccc(F)c1-c1nc2CNC(=O)c2c(Nc2ccc(cc2)C(=O)N2CC3CCC(C2)O3)n1
: