Target
Non-receptor tyrosine-protein kinase TYK2
Ligand
BDBM490688
Substrate
Meas. Tech.
Caliper Assay
Ki
<10±n/a nM
Citation
 Dahlgren, MGreenwood, JRHarriman, GCKennedy-Smith, JJMasse, CERomero, DLShelley, MWester, RT TYK2 inhibitors and uses thereof US Patent  US10968236 Publication Date 4/6/2021 
Target
Name:
Non-receptor tyrosine-protein kinase TYK2
Synonyms:
Non-receptor tyrosine-protein kinase TYK2 (TYK2) TYK2_HUMAN | Tyrosine-protein kinase TYK2
Type:
Protein
Mol. Mass.:
133666.03
Organism:
Homo sapiens (Human)
Description:
P29597
Residue:
1187
  
Inhibitor
Name:
BDBM490688
Synonyms:
US10968236, Compound I-16
Type:
Small organic molecule
Emp. Form.:
C23H21F2N5O3
Mol. Mass.:
453.4413
SMILES:
CCNC(=O)[C@](C)(O)c1ccc(Nc2nc(nc3CNC(=O)c23)-c2c(F)cccc2F)cc1
: