Target
Non-receptor tyrosine-protein kinase TYK2
Ligand
BDBM490689
Substrate
Meas. Tech.
Caliper Assay
Ki
<10±n/a nM
Citation
 Dahlgren, MGreenwood, JRHarriman, GCKennedy-Smith, JJMasse, CERomero, DLShelley, MWester, RT TYK2 inhibitors and uses thereof US Patent  US10968236 Publication Date 4/6/2021 
Target
Name:
Non-receptor tyrosine-protein kinase TYK2
Synonyms:
Non-receptor tyrosine-protein kinase TYK2 (TYK2) TYK2_HUMAN | Tyrosine-protein kinase TYK2
Type:
Protein
Mol. Mass.:
133666.03
Organism:
Homo sapiens (Human)
Description:
P29597
Residue:
1187
  
Inhibitor
Name:
BDBM490689
Synonyms:
US10968236, Compound I-17
Type:
Small organic molecule
Emp. Form.:
C20H15F2N5O
Mol. Mass.:
379.3628
SMILES:
Fc1cccc(F)c1-c1cc(Nc2cc3NCCc3cn2)c2C(=O)NCc2n1
: