Target
Non-receptor tyrosine-protein kinase TYK2
Ligand
BDBM490751
Substrate
Meas. Tech.
Caliper Assay
Ki
<10±n/a nM
Citation
 Dahlgren, MGreenwood, JRHarriman, GCKennedy-Smith, JJMasse, CERomero, DLShelley, MWester, RT TYK2 inhibitors and uses thereof US Patent  US10968236 Publication Date 4/6/2021 
Target
Name:
Non-receptor tyrosine-protein kinase TYK2
Synonyms:
Non-receptor tyrosine-protein kinase TYK2 (TYK2) TYK2_HUMAN | Tyrosine-protein kinase TYK2
Type:
Protein
Mol. Mass.:
133666.03
Organism:
Homo sapiens (Human)
Description:
P29597
Residue:
1187
  
Inhibitor
Name:
BDBM490751
Synonyms:
US10968236, Compound I-79
Type:
Small organic molecule
Emp. Form.:
C25H21FN6O2
Mol. Mass.:
456.4716
SMILES:
Fc1cccc(C#N)c1-c1cc(Nc2ccc(nc2)N2CCOC3(CC3)C2)c2C(=O)NCc2n1
: