Target
Non-receptor tyrosine-protein kinase TYK2
Ligand
BDBM490752
Substrate
Meas. Tech.
Caliper Assay
Ki
<10±n/a nM
Citation
 Dahlgren, MGreenwood, JRHarriman, GCKennedy-Smith, JJMasse, CERomero, DLShelley, MWester, RT TYK2 inhibitors and uses thereof US Patent  US10968236 Publication Date 4/6/2021 
Target
Name:
Non-receptor tyrosine-protein kinase TYK2
Synonyms:
Non-receptor tyrosine-protein kinase TYK2 (TYK2) TYK2_HUMAN | Tyrosine-protein kinase TYK2
Type:
Protein
Mol. Mass.:
133666.03
Organism:
Homo sapiens (Human)
Description:
P29597
Residue:
1187
  
Inhibitor
Name:
BDBM490752
Synonyms:
US10968236, Compound I-80
Type:
Small organic molecule
Emp. Form.:
C24H19FN4O2
Mol. Mass.:
414.4317
SMILES:
CC1(C)COc2cc(Nc3cc(nc4CNC(=O)c34)-c3c(F)cccc3C#N)ccc12
: