Target
Tyrosine-protein kinase JAK2
Ligand
BDBM490759
Substrate
Meas. Tech.
Caliper Assay
Ki
<10±n/a nM
Citation
 Dahlgren, MGreenwood, JRHarriman, GCKennedy-Smith, JJMasse, CERomero, DLShelley, MWester, RT TYK2 inhibitors and uses thereof US Patent  US10968236 Publication Date 4/6/2021 
Target
Name:
Tyrosine-protein kinase JAK2
Synonyms:
JAK-2 JAK2_HUMAN Janus kinase 2 (JAK2) | Janus kinase 2 (a protein tyrosine kinase)
Type:
Protein
Mol. Mass.:
130684.68
Organism:
Homo sapiens (Human)
Description:
O60674
Residue:
1132
  
Inhibitor
Name:
BDBM490759
Synonyms:
US10968236, Compound I-87
Type:
Small organic molecule
Emp. Form.:
C28H25FN6O2
Mol. Mass.:
496.5355
SMILES:
OC1C2(CC2)CN(CC11CC1)c1ccc(Nc2cc(nc3CNC(=O)c23)-c2c(F)cccc2C#N)nc1
: