Target
Tyrosine-protein kinase JAK2
Ligand
BDBM490763
Substrate
Meas. Tech.
Caliper Assay
Ki
<10±n/a nM
Citation
 Dahlgren, MGreenwood, JRHarriman, GCKennedy-Smith, JJMasse, CERomero, DLShelley, MWester, RT TYK2 inhibitors and uses thereof US Patent  US10968236 Publication Date 4/6/2021 
Target
Name:
Tyrosine-protein kinase JAK2
Synonyms:
JAK-2 JAK2_HUMAN Janus kinase 2 (JAK2) | Janus kinase 2 (a protein tyrosine kinase)
Type:
Protein
Mol. Mass.:
130684.68
Organism:
Homo sapiens (Human)
Description:
O60674
Residue:
1132
  
Inhibitor
Name:
BDBM490763
Synonyms:
US10968236, Compound I-91
Type:
Small organic molecule
Emp. Form.:
C26H23FN6O3
Mol. Mass.:
486.4976
SMILES:
O[C@@H]1CO[C@]2(CCN(C2)c2ccc(Nc3cc(nc4CNC(=O)c34)-c3c(F)cccc3C#N)nc2)C1
: