Target
Stimulator of interferon genes protein [H232R]
Ligand
BDBM490773
Substrate
Meas. Tech.
Surface Plasmon Resonance (SPR) Binding
Kd
11.0±n/a nM
Citation
 Wythes, MJMcAlpine, IJPatman, RRui, EYMaderna, AJalaie, MGajiwala, KS Cyclopentane-based modulators of STING (stimulator of interferon genes) US Patent  US10968242 Publication Date 4/6/2021 
Target
Name:
Stimulator of interferon genes protein [H232R]
Synonyms:
ERIS STING STING_HUMAN TMEM173
Type:
Enzyme Catalytic Domain
Mol. Mass.:
42215.19
Organism:
Homo sapiens (Human)
Description:
Residue:
379
  
Inhibitor
Name:
BDBM490773
Synonyms:
US10968242, Example 2 Peak 4
Type:
Small organic molecule
Emp. Form.:
C21H24FN9O9P2S2
Mol. Mass.:
691.546
SMILES:
Cn1cnc2n(cnc2c1=O)[C@@H]1C[C@@H]2OP(S)(=O)O[C@@H]3[C@@H](COP(S)(=O)O[C@@H]1[C@H]2O)O[C@H]([C@H]3F)n1cnc2c(N)ncnc12
: