Target
Stimulator of interferon genes protein [H232R]
Ligand
BDBM490788
Substrate
Meas. Tech.
Surface Plasmon Resonance (SPR) Binding
Kd
132±n/a nM
Citation
 Wythes, MJMcAlpine, IJPatman, RRui, EYMaderna, AJalaie, MGajiwala, KS Cyclopentane-based modulators of STING (stimulator of interferon genes) US Patent  US10968242 Publication Date 4/6/2021 
Target
Name:
Stimulator of interferon genes protein [H232R]
Synonyms:
ERIS STING STING_HUMAN TMEM173
Type:
Enzyme Catalytic Domain
Mol. Mass.:
42215.19
Organism:
Homo sapiens (Human)
Description:
Residue:
379
  
Inhibitor
Name:
BDBM490788
Synonyms:
US10968242, Example 16 Peak 2
Type:
Small organic molecule
Emp. Form.:
C21H24FN9O10P2S
Mol. Mass.:
675.48
SMILES:
Cn1cnc2n(cnc2c1=O)[C@@H]1C[C@@H]2OP(S)(=O)O[C@@H]3[C@@H](COP(O)(=O)O[C@@H]1[C@H]2O)O[C@H]([C@@H]3F)n1cnc2c(N)ncnc12
: