Target
Stimulator of interferon genes protein [H232R]
Ligand
BDBM490790
Substrate
Meas. Tech.
Surface Plasmon Resonance (SPR) Binding
Kd
0.500±n/a nM
Citation
 Wythes, MJMcAlpine, IJPatman, RRui, EYMaderna, AJalaie, MGajiwala, KS Cyclopentane-based modulators of STING (stimulator of interferon genes) US Patent  US10968242 Publication Date 4/6/2021 
Target
Name:
Stimulator of interferon genes protein [H232R]
Synonyms:
ERIS STING STING_HUMAN TMEM173
Type:
Enzyme Catalytic Domain
Mol. Mass.:
42215.19
Organism:
Homo sapiens (Human)
Description:
Residue:
379
  
Inhibitor
Name:
BDBM490790
Synonyms:
US10968242, Example 17 Peak 2
Type:
Small organic molecule
Emp. Form.:
C21H24FN9O8P2S3
Mol. Mass.:
707.612
SMILES:
Cn1cnc2n(cnc2c1=O)[C@@H]1C[C@@H]2OP(S)(=S)O[C@H]3[C@@H](F)[C@@H](O[C@@H]3COP(S)(=O)O[C@@H]1[C@H]2O)n1cnc2c(N)ncnc12
: