Target
ADP-ribosylhydrolase ARH3
Ligand
BDBM421482
Substrate
Meas. Tech.
ARH3 Assay
IC50
>100000±n/a nM
Citation
 McGonagle, AEJordan, AMWaszkowycz, BHutton, CPWaddell, IDHitchin, JRSmith, KMHamilton, NM PARG inhibitory compounds US Patent  US10995073 Publication Date 5/4/2021 
Target
Name:
ADP-ribosylhydrolase ARH3
Synonyms:
ADP-ribose glycohydrolase ARH3 ADPRHL2 ADPRS_HUMAN O-acetyl-ADP-ribose deacetylase ARH3 [Protein ADP-ribosylarginine] hydrolase-like protein 2 | [Protein ADP-ribosylserine] hydrolase
Type:
Enzyme Catalytic Domain
Mol. Mass.:
38934.22
Organism:
Homo sapiens (Human)
Description:
Q9NX46
Residue:
363
  
Inhibitor
Name:
BDBM421482
Synonyms:
US10508086, Example 73 | US10995073, Example 73
Type:
Small organic molecule
Emp. Form.:
C21H20FN5O3S2
Mol. Mass.:
473.544
SMILES:
Cc1nnc(s1)-n1c2cc(ccc2n(Cc2ccc(F)cc2)c1=O)S(=O)(=O)NC1(C)CC1
: