Target
Calcitonin gene-related peptide type 1 receptor
Ligand
BDBM495155
Substrate
Meas. Tech.
Determination of Binding Affinity for CGRP Receptor by Radioligand Binding Assay in SK-N-MC Cell Membranes
Ki
0.040±n/a nM
Citation
 Kondo, AMorita, NIshikawa, TYoshida, MMoriyama, AWanajo, I Pyrrolidine derivative US Patent  US10995084 Publication Date 5/4/2021 
Target
Name:
Calcitonin gene-related peptide type 1 receptor
Synonyms:
Adrenomedullin receptor AM1; CALCRL/RAMP2 CALRL_HUMAN CGRP type 1 receptor mRNA Calcitonin gene-related peptide (CGRP) receptor Calcitonin receptor-like receptor Human CL receptor
Type:
Enzyme Catalytic Domain
Mol. Mass.:
52980.45
Organism:
Homo sapiens (Human)
Description:
Q16602
Residue:
461
  
Inhibitor
Name:
BDBM495155
Synonyms:
US10995084, Ex. No. 5C-1
Type:
Small organic molecule
Emp. Form.:
C30H32ClN5O5
Mol. Mass.:
578.059
SMILES:
Cc1cc(Oc2ccc(cc2C)C(=O)N[C@H](CO)C(=O)N2[C@@H](CC[C@@H]2C(C)(C)C#N)c2cccc(Cl)c2)c(=O)[nH]n1
: