Target
Replicase polyprotein 1ab
Ligand
BDBM495359
Substrate
Meas. Tech.
Fluorescence MPro inhibition assay
IC50
89±n/a nM
Citation
 Achdout, HAimon, ABar-David, EBarr, HBen-Shmuel, ABennett, JBoby, MLBorden, BBowman, GRBrun, JBVNBS, SCalmiano, MCarbery, ACattermole, EChernyshenko, EChodera, JDClyde, ACoffland, JECohen, GCole, JContini, ACox, LCvitkovic, MDias, ADonckers, KDotson, DLDouangamath, ADuberstein, SDudgeon, TDunnett, LEastman, PKErez, NEyermann, CJFairhead, MFate, GFearon, DFedorov, OFerla, MFernandes, RSFerrins, LFoster, RFoster, HGabizon, RGarcia-Sastre, AGawriljuk, VOGehrtz, PGileadi, CGiroud, CGlass, WGGlen, RGlinert, IGodoy, ASGorichko, MGorrie-Stone, TGriffen, EJHart, SHHeer, JHenry, MHill, MHorrell, SHurley, MFIsraely, TJajack, AJnoff, EJochmans, DJohn, TJonghe, SDKantsadi, ALKenny, PWKiappes, JLKoekemoer, LKovar, BKrojer, TLee, AALefker, BALevy, HLondon, NLukacik, PMacdonald, HBMacLean, BMalla, TRMatviiuk, TMcCorkindale, WMcGovern, BLMelamed, SMichurin, OMikolajek, HMilne, BFMorris, AMorris, GMMorwitzer, MJMoustakas, DNakamura, AMNeto, JBNeyts, JNguyen, LNoske, GDOleinikovas, VOliva, GOverheul, GJOwen, DPsenak, VPai, RPan, JParan, NPerry, BPingle, MPinjari, JPoliti, BPowell, APuni, RRangel, VLReddi, RNReid, SPResnick, ERipka, EGRobinson, MCRobinson, RPRodriguez-Guerra, JRosales, RRufa, DSchofield, CShafeev, MShaikh, AShi, JShurrush, KSingh, SSittner, ASkyner, RSmalley, ASmilova, MDSolmesky, LJSpencer, JStrain-Damerell, CSwamy, VTamir, HTennant, RThompson, WThompson, AThompson, WTomasio, STumber, AVakonakis, Ivan Rij, RPVangeel, LVarghese, FSVaschetto, MVitner, EBVoelz, VVolkamer, Avon Delft, Fvon Delft, AWalsh, MWard, WWeatherall, CWeiss, SWhite, KMWild, CFWittmann, MWright, NYahalom-Ronen, YZaidmann, DZidane, HZitzmann, N Open Science Discovery of Oral Non-Covalent SARS-CoV-2 Main Protease Inhibitor Therapeutics bioRxiv 2021:0 (2021)   
Target
Name:
Replicase polyprotein 1ab
Synonyms:
ORF1ab polyprotein pp1ab | rep
Type:
Protein
Mol. Mass.:
794070.71
Organism:
2019-nCoV
Description:
P0DTD1
Residue:
7096
  
Inhibitor
Name:
BDBM495359
Synonyms:
EDJ-MED-1981ceba-2
Type:
Small Organic Molecule
Emp. Form.:
C22H21ClN4O3S
Mol. Mass.:
456.945
SMILES:
Clc1ccc2CN(CC(C(=O)Nc3cncc4ccccc34)c2c1)S(=O)(=O)N1CCC1
: