Target
Replicase polyprotein 1ab
Ligand
BDBM496444
Substrate
Meas. Tech.
Secondary Binding Analysis by Surface Plasmon Resonance
Kd
31100±n/a nM
Citation
 Shen, ZRatia, KCooper, LKong, DLee, HKwon, YLi, YAlqarni, SHuang, FDubrovskyi, ORong, LThatcher, GRJXiong, R Design of SARS-CoV-2 PLpro Inhibitors for COVID-19 Antiviral Therapy Leveraging Binding Cooperativity. J Med Chem 0:0 (2021)  
Target
Name:
Replicase polyprotein 1ab
Synonyms:
ORF1ab polyprotein pp1ab | rep
Type:
Protein
Mol. Mass.:
794070.71
Organism:
2019-nCoV
Description:
P0DTD1
Residue:
7096
  
Inhibitor
Name:
BDBM496444
Synonyms:
SARS-CoV-2 PLpro Inhibitor, 4
Type:
Small Organic Molecule
Emp. Form.:
C31H37N3O4
Mol. Mass.:
515.6432
SMILES:
C[C@@H](NC(=O)c1cc(NC(=O)C2CCN(CC2)C(=O)OC(C)(C)C)ccc1C)c1cccc2ccccc12
: