Target
Replicase polyprotein 1ab
Ligand
BDBM496795
Substrate
Meas. Tech.
PLpro Primary Assay
IC50
>100000±n/a nM
Citation
 Shen, ZRatia, KCooper, LKong, DLee, HKwon, YLi, YAlqarni, SHuang, FDubrovskyi, ORong, LThatcher, GRJXiong, R Design of SARS-CoV-2 PLpro Inhibitors for COVID-19 Antiviral Therapy Leveraging Binding Cooperativity. J Med Chem 0:0 (2021)  
Target
Name:
Replicase polyprotein 1ab
Synonyms:
ORF1ab polyprotein pp1ab | rep
Type:
Protein
Mol. Mass.:
794070.71
Organism:
2019-nCoV
Description:
P0DTD1
Residue:
7096
  
Inhibitor
Name:
BDBM496795
Synonyms:
SARS-CoV-2 PLpro Inhibitor, 25
Type:
Small Organic Molecule
Emp. Form.:
C21H18N2O
Mol. Mass.:
314.3804
SMILES:
C[C@@H](NC(=O)c1c[nH]c2ccccc12)c1cccc2ccccc12
: