Target
Replicase polyprotein 1ab
Ligand
BDBM496813
Substrate
Meas. Tech.
Secondary Binding Analysis by Surface Plasmon Resonance
Kd
>1000000±n/a nM
Citation
 Shen, ZRatia, KCooper, LKong, DLee, HKwon, YLi, YAlqarni, SHuang, FDubrovskyi, ORong, LThatcher, GRJXiong, R Design of SARS-CoV-2 PLpro Inhibitors for COVID-19 Antiviral Therapy Leveraging Binding Cooperativity. J Med Chem 0:0 (2021)  
Target
Name:
Replicase polyprotein 1ab
Synonyms:
ORF1ab polyprotein pp1ab | rep
Type:
Protein
Mol. Mass.:
794070.71
Organism:
2019-nCoV
Description:
P0DTD1
Residue:
7096
  
Inhibitor
Name:
BDBM496813
Synonyms:
SARS-CoV-2 PLpro Inhibitor, 43
Type:
Small Organic Molecule
Emp. Form.:
C26H30N4O2
Mol. Mass.:
430.542
SMILES:
CN(C)C(=O)C[C@@H](NC(=O)c1cccc(c1)N(C)C1CNC1)c1cccc2ccccc12
: