Target
Replicase polyprotein 1ab
Ligand
BDBM496866
Substrate
Meas. Tech.
PLpro Primary Assay
IC50
810±n/a nM
Citation
 Shen, ZRatia, KCooper, LKong, DLee, HKwon, YLi, YAlqarni, SHuang, FDubrovskyi, ORong, LThatcher, GRJXiong, R Design of SARS-CoV-2 PLpro Inhibitors for COVID-19 Antiviral Therapy Leveraging Binding Cooperativity. J Med Chem 0:0 (2021)  
Target
Name:
Replicase polyprotein 1ab
Synonyms:
ORF1ab polyprotein pp1ab | rep
Type:
Protein
Mol. Mass.:
794070.71
Organism:
2019-nCoV
Description:
P0DTD1
Residue:
7096
  
Inhibitor
Name:
BDBM496866
Synonyms:
SARS-CoV-2 PLpro Inhibitor, 96
Type:
Small Organic Molecule
Emp. Form.:
C26H31N3O3S
Mol. Mass.:
465.608
SMILES:
C[C@@H](NC(=O)c1cc(N)ccc1C)c1cccc(c1)-c1ccc(CNC(=O)OC(C)(C)C)s1
: