Target
Replicase polyprotein 1ab
Ligand
BDBM496869
Substrate
Meas. Tech.
Secondary Binding Analysis by Surface Plasmon Resonance
Kd
3330±n/a nM
Citation
 Shen, ZRatia, KCooper, LKong, DLee, HKwon, YLi, YAlqarni, SHuang, FDubrovskyi, ORong, LThatcher, GRJXiong, R Design of SARS-CoV-2 PLpro Inhibitors for COVID-19 Antiviral Therapy Leveraging Binding Cooperativity. J Med Chem 0:0 (2021)  
Target
Name:
Replicase polyprotein 1ab
Synonyms:
ORF1ab polyprotein pp1ab | rep
Type:
Protein
Mol. Mass.:
794070.71
Organism:
2019-nCoV
Description:
P0DTD1
Residue:
7096
  
Inhibitor
Name:
BDBM496869
Synonyms:
SARS-CoV-2 PLpro Inhibitor, 99
Type:
Small Organic Molecule
Emp. Form.:
C25H27N3O3S
Mol. Mass.:
449.565
SMILES:
C[C@@H](NC(=O)c1cc(NC(C)=O)ccc1C)c1cccc(c1)-c1ccc(CNC(C)=O)s1
: