Target
Replicase polyprotein 1ab
Ligand
BDBM496879
Substrate
Meas. Tech.
Antiviral assay
EC50
3100±n/a nM
Citation
 Ghosh, AKRaghavaiah, JShahabi, DYadav, MAnson, BJLendy, EKHattori, SIHigashi-Kuwata, NMitsuya, HMesecar, AD Indole Chloropyridinyl Ester-Derived SARS-CoV-2 3CLpro Inhibitors: Enzyme Inhibition, Antiviral Efficacy, Structure-Activity Relationship, and X-ray Structural Studies. J Med Chem 64:14702-14714 (2021)  
Target
Name:
Replicase polyprotein 1ab
Synonyms:
ORF1ab polyprotein pp1ab | rep
Type:
Protein
Mol. Mass.:
794070.71
Organism:
2019-nCoV
Description:
P0DTD1
Residue:
7096
  
Inhibitor
Name:
BDBM496879
Synonyms:
indole chloropyridinyl-ester derived, 7h
Type:
Small Organic Molecule
Emp. Form.:
C15H11ClN2O2
Mol. Mass.:
286.713
SMILES:
Cc1cc(C(=O)Oc2cncc(Cl)c2)c2cc[nH]c2c1
: