Target
Replicase polyprotein 1ab
Ligand
BDBM496908
Substrate
Meas. Tech.
Various Assay
IC50
5000±n/a nM
Citation
 Chia, CSBXu, WNg, PS A patent review on SARS coronavirus main protease (3CLpro) inhibitors. ChemMedChem 0:0 (2021)  
Target
Name:
Replicase polyprotein 1ab
Synonyms:
3C-like proteinase 3C-like proteinase (SARS-CoV 3Cpro) 3CLp GFL Guanine-N7 methyltransferase Helicase Leader protein Non-structural protein 10 Non-structural protein 3 Non-structural protein 6 Non-structural protein 8 ORF1ab polyprotein PL2-PRO Pol R1AB_SARS RdRp SARS coronavirus main proteinase nsp1 nsp12 nsp14 nsp16 nsp3 nsp5 nsp7 nsp9 pp1ab | rep
Type:
Protein
Mol. Mass.:
790250.81
Organism:
Human SARS coronavirus (SARS-CoV) (Severe acute respiratory syndrome coronavirus)
Description:
P0C6X7
Residue:
7073
  
Inhibitor
Name:
BDBM496908
Synonyms:
acs.jmedchem.1c00409_ST.371 | cmdc.202100576, 7d
Type:
Small organic molecule
Emp. Form.:
C14H10F3N5O4S
Mol. Mass.:
401.321
SMILES:
Cc1noc(NC(=O)c2ccc(s2)-c2cc(nn2C)C(F)(F)F)c1[N+]([O-])=O
: