Target
Replicase polyprotein 1ab
Ligand
BDBM423465
Substrate
Meas. Tech.
Various Assay
IC50
20±n/a nM
Citation
 Chia, CSBXu, WNg, PS A patent review on SARS coronavirus main protease (3CLpro) inhibitors. ChemMedChem 0:0 (2021)  
Target
Name:
Replicase polyprotein 1ab
Synonyms:
3C-like proteinase 3C-like proteinase (SARS-CoV 3Cpro) 3CLp GFL Guanine-N7 methyltransferase Helicase Leader protein Non-structural protein 10 Non-structural protein 3 Non-structural protein 6 Non-structural protein 8 ORF1ab polyprotein PL2-PRO Pol R1AB_SARS RdRp SARS coronavirus main proteinase nsp1 nsp12 nsp14 nsp16 nsp3 nsp5 nsp7 nsp9 pp1ab | rep
Type:
Protein
Mol. Mass.:
790250.81
Organism:
Human SARS coronavirus (SARS-CoV) (Severe acute respiratory syndrome coronavirus)
Description:
P0C6X7
Residue:
7073
  
Inhibitor
Name:
BDBM423465
Synonyms:
US11753373, Compound A-1-c WO2006061714-ID-10 | cmdc.202100576, 10b
Type:
Small Organic Molecule
Emp. Form.:
C22H28N4O4
Mol. Mass.:
412.4821
SMILES:
CC(C)C[C@H](NC(=O)c1cc2ccccc2[nH]1)C(=O)N[C@@H](C[C@@H]1CCNC1=O)C=O
: