Target
Replicase polyprotein 1ab
Ligand
BDBM423469
Substrate
Meas. Tech.
Various Assay
IC50
50±n/a nM
Citation
 Chia, CSBXu, WNg, PS A patent review on SARS coronavirus main protease (3CLpro) inhibitors. ChemMedChem 0:0 (2021)  
Target
Name:
Replicase polyprotein 1ab
Synonyms:
3C-like proteinase 3C-like proteinase (SARS-CoV 3Cpro) 3CLp GFL Guanine-N7 methyltransferase Helicase Leader protein Non-structural protein 10 Non-structural protein 3 Non-structural protein 6 Non-structural protein 8 ORF1ab polyprotein PL2-PRO Pol R1AB_SARS RdRp SARS coronavirus main proteinase nsp1 nsp12 nsp14 nsp16 nsp3 nsp5 nsp7 nsp9 pp1ab | rep
Type:
Protein
Mol. Mass.:
790250.81
Organism:
Human SARS coronavirus (SARS-CoV) (Severe acute respiratory syndrome coronavirus)
Description:
P0C6X7
Residue:
7073
  
Inhibitor
Name:
BDBM423469
Synonyms:
WO2006061714, P39.4 cmdc.202100576, 10e
Type:
Small Organic Molecule
Emp. Form.:
C23H32N4O5
Mol. Mass.:
444.524
SMILES:
COc1cccc2[nH]c(cc12)C(=O)N[C@@H](CC(C)C)C(=O)N[C@@H](CCC(=O)N(C)C)C=O
: