Target
Replicase polyprotein 1ab
Ligand
BDBM496928
Substrate
Meas. Tech.
Various Assay
IC50
330±n/a nM
Citation
 Chia, CSBXu, WNg, PS A patent review on SARS coronavirus main protease (3CLpro) inhibitors. ChemMedChem 0:0 (2021)  
Target
Name:
Replicase polyprotein 1ab
Synonyms:
ORF1ab polyprotein pp1ab | rep
Type:
Protein
Mol. Mass.:
794070.71
Organism:
2019-nCoV
Description:
P0DTD1
Residue:
7096
  
Inhibitor
Name:
BDBM496928
Synonyms:
GC376 | cmdc.202100576, 14c
Type:
Small organic molecule
Emp. Form.:
C21H30N3O8S
Mol. Mass.:
484.544
SMILES:
CC(C)C[C@@H](NC(=O)OCc1ccccc1)C(=O)N[C@H](CC1CCNC1=O)C(O)S([O-])(=O)=O
: