Target
Replicase polyprotein 1ab
Ligand
BDBM496959
Substrate
Meas. Tech.
Various Assay
IC50
<1.00±n/a nM
Citation
 Chia, CSBXu, WNg, PS A patent review on SARS coronavirus main protease (3CLpro) inhibitors. ChemMedChem 0:0 (2021)  
Target
Name:
Replicase polyprotein 1ab
Synonyms:
2.1.1.- 3.1.-.- 3.4.19.12 3.4.22.69 3.6.4.13 3CL-PRO ExoN Growth factor-like peptide Hel Host translation inhibitor nsp1 NendoU Non-structural protein 2 Non-structural protein 4 Non-structural protein 7 Non-structural protein 9 PL-PRO Pol RNA-directed RNA polymerase Replicase polyprotein 1ab nsp1 nsp12 nsp14 nsp16 nsp3 nsp5 nsp7 nsp9 pp1ab | rep
Type:
PROTEIN
Mol. Mass.:
789589.93
Organism:
Middle East respiratory syndrome-related coronavirus (isolate UnitedKingdom/H123990006/2012) (Betacoronavirus England 1) (Humancoronavirus EMC)
Description:
ChEMBL_117802
Residue:
7078
  
Inhibitor
Name:
BDBM496959
Synonyms:
cmdc.202100576, 23b
Type:
Small organic molecule
Emp. Form.:
C33H44N4O6
Mol. Mass.:
592.7257
SMILES:
O=C(N[C@@H](C[C@@H]1CCCNC1=O)C(=O)C(=O)NC1CCCCC1)[C@H](CC1CCCCC1)NC(=O)c1cc2ccccc2o1
: