Target
Replicase polyprotein 1ab
Ligand
BDBM420298
Substrate
Meas. Tech.
fluorescence resonance energy transfer (FRET)-based substrate cleavage assay
Ki
0.27±n/a nM
Target
Name:
Replicase polyprotein 1ab
Synonyms:
ORF1ab polyprotein pp1ab | rep
Type:
Protein
Mol. Mass.:
794070.71
Organism:
2019-nCoV
Description:
P0DTD1
Residue:
7096
  
Inhibitor
Name:
BDBM420298
Synonyms:
CVD-0006356 PF-0835231 US11753373, Compound A-5-d WO2021205298, Compound 1 | cmdc.202100576, 6b
Type:
Small organic molecule
Emp. Form.:
C24H32N4O6
Mol. Mass.:
472.5341
SMILES:
COc1cccc2[nH]c(cc12)C(=O)N[C@@H](CC(C)C)C(=O)N[C@@H](C[C@@H]1CCNC1=O)C(=O)CO
: