Target
Acetyl-CoA carboxylase 2
Ligand
BDBM489762
Substrate
Meas. Tech.
In Vitro Acetyl-CoA Carboxylase (ACC) Inhibition Assay
IC50
55±n/a nM
Citation
 Zhang, JLiao, HWang, PWang, P Compounds and their uses as ACC inhibitors US Patent  US10995099 Publication Date 5/4/2021 
Target
Name:
Acetyl-CoA carboxylase 2
Synonyms:
ACACB ACC-beta ACCB Acetyl-CoA carboxylase 2 Acetyl-CoA carboxylase 2 (ACC2)
Type:
Protein
Mol. Mass.:
276535.21
Organism:
Homo sapiens (Human)
Description:
O00763
Residue:
2458
  
Inhibitor
Name:
BDBM489762
Synonyms:
US10995099, Example 21 | US10995099, Example 4
Type:
Small organic molecule
Emp. Form.:
C28H33N3O8S
Mol. Mass.:
571.642
SMILES:
COc1ccccc1[C@H](Cn1c2sc(C(=O)N(C)C)c(C)c2c(=O)n(c1=O)C1(CC1)C(O)=O)OC1CCOCC1
: