Target
Acetyl-CoA carboxylase 1
Ligand
BDBM496912
Substrate
Meas. Tech.
In Vitro Acetyl-CoA Carboxylase (ACC) Inhibition Assay
IC50
5.50±n/a nM
Citation
 Zhang, JLiao, HWang, PWang, P Compounds and their uses as ACC inhibitors US Patent  US10995099 Publication Date 5/4/2021 
Target
Name:
Acetyl-CoA carboxylase 1
Synonyms:
ACAC ACACA_HUMAN ACC1 Acetyl-CoA carboxylase 1 | Acetyl-CoA carboxylase 1 (ACC1)
Type:
Protein
Mol. Mass.:
265543.22
Organism:
Homo sapiens (Human)
Description:
Q13085
Residue:
2346
  
Inhibitor
Name:
BDBM496912
Synonyms:
US10995099, Example 46
Type:
Small organic molecule
Emp. Form.:
C28H30N4O7S
Mol. Mass.:
566.625
SMILES:
COc1ccccc1C(Cn1c2sc(c(C)c2c(=O)n(c1=O)C1(CC1)C(N)=O)-c1ncco1)OC1CCOCC1
: