Target
Acetyl-CoA carboxylase 2
Ligand
BDBM496968
Substrate
Meas. Tech.
In Vitro Acetyl-CoA Carboxylase (ACC) Inhibition Assay
IC50
55±n/a nM
Citation
 Zhang, JLiao, HWang, PWang, P Compounds and their uses as ACC inhibitors US Patent  US10995099 Publication Date 5/4/2021 
Target
Name:
Acetyl-CoA carboxylase 2
Synonyms:
ACACB ACC-beta ACCB Acetyl-CoA carboxylase 2 Acetyl-CoA carboxylase 2 (ACC2)
Type:
Protein
Mol. Mass.:
276535.21
Organism:
Homo sapiens (Human)
Description:
O00763
Residue:
2458
  
Inhibitor
Name:
BDBM496968
Synonyms:
US10995099, Example 58
Type:
Small organic molecule
Emp. Form.:
C25H28BrN3O6S
Mol. Mass.:
578.475
SMILES:
COc1ccccc1[C@H](Cn1c2sc(Br)c(C)c2c(=O)n(c1=O)C1(CC1)C(N)=O)OC1CCOCC1
: